{"text_format":"1","workbook":"xlsx","n_sheets":6,"sheets":["INSTRUCCIONES","1-INFORME RESULTADOS","2-INVENTARIO CALIFICACIONES","auxiliar1","directorio.viejo","dir20190527"],"not_rendered":{"charts":0,"images":10,"macros":1,"external_links":0,"defined_names":1,"comments":0,"pivot_tables":0},"unopened":[],"bounds":{"document_bytes":16777216,"sheet_cells":100000,"rows_first":2000,"rows_last":500,"rows_between":2000,"halvings":0,"cell_chars":16384,"cell_head_chars":4096},"cells_cut":0,"cells_raw":0,"read":"whole","date_system":"1900"}

{"sheet":"INSTRUCCIONES","index":0,"n_rows":197,"n_cols":18,"rows_kept":197,"cut":false,"hidden":false,"merged":[[158,15,160,15]]}
[]
[]
[]
[]
[null,"Los Centros deberán remitir los documentos por correo electrónico en los formatos originales:"]
[null,"-","Anexo III según la hoja de cálculo distribuida (formato xlsm) a: evaluacion@aragon.es"]
[]
[null,"Los Centros deberán remitir por correo ordinario:"]
[null,"-","Anexo III en formato papel, sellado y firmado, a la Inspección de Educación provincial correspondiente."]
[null,"-","La valoración de los resultados académicos se incluirá en la Memoria Anual, no se envía."]
[]
[null,"En cada uno de los ficheros que vayan a utilizar en su Centro, solamente se introducirá la información solicitada en los espacios habilitados"]
[null,"para ello en las hojas 1 y 2 (color amarillo o verde). El resto, se encuentra protegido. La organización de los códigos de color es la siguiente:"]
[null,null,"Color amarillo:",null,"Sí se puede escribir. Zona de texto"]
[null,null,"Color verde: ",null,"Sí se puede escribir. Zona de número"]
[null,null,"Color naranja:",null,"Se completa de manera automática al introducir el código de centro. Si es necesario, se puede corregir."]
[null,null,"Color azul: ",null,"Verifica la información introducida. En caso de error deben corregirse los valores introducidos en las casillas correspondientes."]
[null,null,"Color rojo:",null,"Totales calculados de manera automática a partir de otros valores. No se pueden modificar."]
[]
[null,"Se debe comenzar cumplimentando el código de centro (celda J8)"]
{"$rows_left_out":178}
{"sheet":"1-INFORME RESULTADOS","index":1,"n_rows":40,"n_cols":26,"rows_kept":40,"cut":false,"hidden":false,"merged":[[32,4,32,7],[32,10,32,13],[32,16,32,19],[10,1,11,1],[10,3,10,4],[10,5,10,6],[10,7,10,8],[10,9,10,10],[10,11,10,12],[10,13,10,14],[10,15,10,20],[25,3,25,7],[25,9,25,10],[25,12,25,13],[7,17,7,18],[7,19,7,20],[8,2,8,3],[8,5,8,8],[8,11,8,12],[8,13,8,14],[8,15,8,16],[8,18,8,20],[7,13,7,16],[5,3,5,4],[7,2,7,6],[7,7,7,8],[7,9,7,10],[7,11,7,12]]}
[]
[]
[]
[null,null,null,"ANEXO III - ESO",null,null,"INFORME DE LOS RESULTADOS DE LA EVALUACIÓN FINAL DEL ALUMNADO"]
[]
[null,null,"Año Académico: ","2019-2020",null,null,null,null,"EDUCACIÓN SECUNDARIA OBLIGATORIA",null,null,null,null,"PRESENCIAL"]
[]
[null,"Centro:",{"$f":"IFERROR(VLOOKUP(J8,dir20190527!$A$2:$J$1046,5,0),\"\")","v":""},null,null,null,null,"Código centro:",null,"introducir código",null,"Correo electrónico",null,{"$f":"IFERROR(VLOOKUP(J8,dir20190527!$A$2:$J$1046,10,0),\"\")","v":""},null,null,null,"Titularidad del nivel educativo"]
[null,"Dirección:",{"$f":"IFERROR(VLOOKUP(J8,dir20190527!$A$2:$J$1046,6,0),\"\")","v":""},null,"Localidad:",{"$f":"IFERROR(VLOOKUP(J8,dir20190527!$A$2:$J$1046,4,0),\"\")","v":""},null,null,null,"Provincia:",null,{"$f":"IFERROR(VLOOKUP(J8,dir20190527!$A$2:$J$1046,2,0),\"\")","v":""},null,"Cód Postal:",null,{"$f":"IFERROR(VLOOKUP(J8,dir20190527!$A$2:$J$1046,7,0),\"\")","v":""},null,"Teléf:",{"$f":"IFERROR(VLOOKUP(J8,dir20190527!$A$2:$J$1046,8,0),\"\")","v":""},null,null,null,null,null,"Ord (neg1+neg2+neg3+neg4m)="]
[" ",null,null,1,2,3,4,5,6,7,8,9,10,11,12,13,14,15,16,17,18,19,null,"mat=eval","Ext (pos+neg1+neg2+neg3+neg4m)","prom<=eval"]
[null,"CURSO\n",null,"Matrículados\n y evaluados",null,"Positiva en todas",null,"Negativa en UNA",null,"Negativa en DOS",null,"Negativa en TRES",null,"Negativa en CUATRO o más",null,"Número de alumnos que \nPROMOCIONAN (1º, 2º, 3º) \no TITULAN (4º)",null,null,null,null,null,"Número de alumnos que \nNO PROMOCIONAN",null,"1 = 2","5+7+9+11=4+6+8+10+12","13+14+15+16+17<=2"]
[null,null,null,"Matri-\nculados","Evaluados","Ordinaria","Extra-ordinaria","Ordinaria","Extra-ordinaria","Ordinaria","Extra-ordinaria","Ordinaria","Extra-ordinaria","Ordinaria","Extra-ordinaria","POSITIVA en todas","NEGATIVA en UNA","NEGATIVA en DOS","NEGATIVA en TRES","PIL\nArtíc 11.6 (1)","TOTAL","TOTAL"]
[{"$f":"+$J$8","v":"introducir código"},"1º ESO","Hombres",null,{"$f":"F13+H13+J13+L13+N13","v":0},null,null,null,null,null,null,null,null,null,null,{"$f":"F13+G13","v":0},null,null,null,null,{"$f":"P13+Q13+R13+S13+T13","v":0},{"$f":"+E13-U13","v":0},"Hombres",{"$f":"IF(D13=E13,\"Correcto\",\"Error\")","v":"Correcto"},{"$f":"IF(H13+J13+L13+N13=G13+I13+K13+M13+O13,\"Correcto\",\"Error\")","v":"Correcto"},{"$f":"IF(SUM(P13:T13)>E13,\"Error\",\"Correcto\")","v":"Correcto"}]
[{"$f":"+$J$8","v":"introducir código"},"1º ESO","Mujeres",null,{"$f":"F14+H14+J14+L14+N14","v":0},null,null,null,null,null,null,null,null,null,null,0,null,null,null,null,{"$f":"P14+Q14+R14+S14+T14","v":0},{"$f":"+E14-U14","v":0},"Mujeres","Correcto",{"$f":"IF(H14+J14+L14+N14=G14+I14+K14+M14+O14,\"Correcto\",\"Error\")","v":"Correcto"},{"$f":"IF(SUM(P14:T14)>E14,\"Error\",\"Correcto\")","v":"Correcto"}]
["introducir código","2º ESO","Hombres",null,{"$f":"F15+H15+J15+L15+N15","v":0},null,null,null,null,null,null,null,null,null,null,0,null,null,null,null,0,0,"Hombres","Correcto","Correcto","Correcto"]
["introducir código","2º ESO","Mujeres",null,0,null,null,null,null,null,null,null,null,null,null,0,null,null,null,null,0,0,"Mujeres","Correcto","Correcto","Correcto"]
["introducir código","3º ESO","Hombres",null,0,null,null,null,null,null,null,null,null,null,null,0,null,null,null,null,0,0,"Hombres","Correcto","Correcto","Correcto"]
["introducir código","3º ESO","Mujeres",null,0,null,null,null,null,null,null,null,null,null,null,0,null,null,null,null,0,0,"Mujeres","Correcto","Correcto","Correcto"]
["introducir código","4º ESO","Hombres",null,0,null,null,null,null,null,null,null,null,null,null,0,null,null,null,0,0,0,"Hombres","Correcto",{"$f":"IF(H19+J19+L19+N19>=G19+I19+K19+M19+O19,\"Correcto\",\"Error\")","v":"Correcto"},"Correcto"]
["introducir código","4º ESO","Mujeres",null,0,null,null,null,null,null,null,null,null,null,null,0,null,null,null,0,0,0,"Mujeres","Correcto",{"$f":"IF(H20+J20+L20+N20>=G20+I20+K20+M20+O20,\"Correcto\",\"Error\")","v":"Correcto"},"Correcto"]
{"$rows_left_out":21}
{"sheet":"2-INVENTARIO CALIFICACIONES","index":2,"n_rows":183,"n_cols":18,"rows_kept":183,"cut":false,"hidden":false,"merged":[[158,3,158,6],[161,1,165,13],[167,1,167,6],[167,8,167,9],[167,11,167,12],[174,1,174,2],[174,5,174,7],[174,10,174,12],[152,3,152,6],[153,3,153,6],[154,3,154,6],[155,3,155,6],[156,3,156,6],[157,3,157,6],[146,3,146,6],[147,3,147,6],[148,3,148,6],[149,3,149,6],[150,3,150,6],[151,3,151,6],[140,3,140,6],[141,3,141,6],[142,3,142,6],[143,3,143,6],[144,3,144,6],[145,3,145,6],[134,3,134,6],[135,3,135,6],[136,3,136,6],[137,3,137,6],[138,3,138,6],[139,3,139,6],[128,3,128,6],[129,3,129,6],[130,3,130,6],[131,3,131,6],[132,3,132,6],[133,3,133,6],[122,3,122,6],[123,3,123,6],[124,3,124,6],[125,3,125,6],[126,3,126,6],[127,3,127,6],[116,3,116,6],[117,3,117,6],[118,3,118,6],[119,3,119,6],[120,3,120,6],[121,3,121,6],[110,3,110,6],[111,3,111,6],[112,3,112,6],[113,3,113,6],[114,3,114,6],[115,3,115,6],[104,3,104,6],[105,3,105,6],[106,3,106,6],[107,3,107,6],[108,3,108,6],[109,3,109,6],[98,3,98,6],[99,3,99,6],[100,3,100,6],[101,3,101,6],[102,3,102,6],[103,3,103,6],[92,3,92,6],[93,3,93,6],[94,3,94,6],[95,3,95,6],[96,3,96,6],[97,3,97,6],[86,3,86,6],[87,3,87,6],[88,3,88,6],[89,3,89,6],[90,3,90,6],[91,3,91,6],[80,3,80,6],[81,3,81,6],[82,3,82,6],[83,3,83,6],[84,3,84,6],[85,3,85,6],[74,3,74,6],[75,3,75,6],[76,3,76,6],[77,3,77,6],[78,3,78,6],[79,3,79,6],[68,3,68,6],[69,3,69,6],[70,3,70,6],[71,3,71,6],[72,3,72,6],[73,3,73,6],[62,3,62,6],[63,3,63,6],[64,3,64,6],[65,3,65,6],[66,3,66,6],[67,3,67,6],[56,3,56,6],[57,3,57,6],[58,3,58,6],[59,3,59,6],[60,3,60,6],[61,3,61,6],[50,3,50,6],[51,3,51,6],[52,3,52,6],[53,3,53,6],[54,3,54,6],[55,3,55,6],[44,3,44,6],[45,3,45,6],[46,3,46,6],[47,3,47,6],[48,3,48,6],[49,3,49,6],[38,3,38,6],[39,3,39,6],[40,3,40,6],[41,3,41,6],[42,3,42,6],[43,3,43,6],[32,3,32,6],[33,3,33,6],[34,3,34,6],[35,3,35,6],[36,3,36,6],[37,3,37,6],[26,3,26,6],[27,3,27,6],[28,3,28,6],[29,3,29,6],[30,3,30,6],[31,3,31,6],[20,3,20,6],[21,3,21,6],[22,3,22,6],[23,3,23,6],[24,3,24,6],[25,3,25,6],[13,1,13,13],[15,8,15,13],[16,3,16,6],[17,3,17,6],[18,3,18,6],[19,3,19,6],[8,2,8,3],[10,2,10,5],[10,6,10,7],[10,9,10,10],[10,11,10,13],[11,2,11,4],[11,6,11,8],[11,9,11,10],[11,11,11,13]]}
[]
[]
[]
[]
[]
[null,null,"ANEXO III - ESO",null,"Inventario de calificaciones finales obtenidas por el alumnado en las diferentes materias"]
[]
[]
["Año Académico:",null,{"$f":"+'1-INFORME RESULTADOS'!D6","v":"2019-2020"},null,null,null,null,"EDUCACIÓN SECUNDARIA OBLIGATORIA",null,null,null,"PRESENCIAL"]
[]
[null,"Centro:",{"$f":"'1-INFORME RESULTADOS'!C8","v":""},null,null,null,"Código centro:",null,{"$f":"'1-INFORME RESULTADOS'!J8","v":"introducir código"},"Correo electrónico",null,{"$f":"'1-INFORME RESULTADOS'!N8","v":""}]
[null,"Dirección:",{"$f":"'1-INFORME RESULTADOS'!C9","v":""},null,null,"Localidad:",{"$f":"'1-INFORME RESULTADOS'!F9","v":""},null,null,"Provincia:",null,{"$f":"'1-INFORME RESULTADOS'!L9","v":""}]
[]
[null,"Inventario de calificaciones finales obtenidas por el alumnado en las diferentes materias"]
[null,1,2,4,5,6,7,8,9,10,11,12,13,14]
[null,null,null,"Si no se imparte la materia, no cumplimentar",null,null,null,null,"calificaciones finales (incluir en IN los no presentados en septiembre)"]
[null,"mod-reg","curso","Materia",null,null,null," NP\n(Sólo \nevaluac. \nextraord.)","IN","SU ","BI","NT","SB","Total \nalumnos",null,"total alumnos correcto","NP<=IN"]
[{"$f":"+$E$12","v":0},"PRESENCIAL_DIURNO","1º ESO","Lengua castellana y literatura",null,null,null,null,null,null,null,null,null,{"$f":"I18+J18+K18+L18+M18","v":0},null,{"$f":"IF('1-INFORME RESULTADOS'!$E$13+'1-INFORME RESULTADOS'!$E$14='2-INVENTARIO CALIFICACIONES'!N18,\"\",\"Error\")","v":""},{"$f":"IF(I18>=H18,\"\",\"Error\")","v":""},"nota: total alumnos debe ser igual a nº de evaluados"]
[0,"PRESENCIAL_DIURNO","1º ESO","Geografía e historia",null,null,null,null,null,null,null,null,null,{"$f":"I19+J19+K19+L19+M19","v":0},null,{"$f":"IF('1-INFORME RESULTADOS'!$E$13+'1-INFORME RESULTADOS'!$E$14='2-INVENTARIO CALIFICACIONES'!N19,\"\",\"Error\")","v":""},{"$f":"IF(I19>=H19,\"\",\"Error\")","v":""},"nota: total alumnos debe ser igual a nº de evaluados"]
[0,"PRESENCIAL_DIURNO","1º ESO","Matemáticas",null,null,null,null,null,null,null,null,null,0,null,{"$f":"IF('1-INFORME RESULTADOS'!$E$13+'1-INFORME RESULTADOS'!$E$14='2-INVENTARIO CALIFICACIONES'!N20,\"\",\"Error\")","v":""},"","nota: total alumnos debe ser igual a nº de evaluados"]
{"$rows_left_out":164}
{"sheet":"auxiliar1","index":3,"n_rows":2,"n_cols":1,"rows_kept":2,"cut":false,"hidden":true,"merged":[]}
["Privada concertada"]
["Privada NO concertada"]

{"sheet":"directorio.viejo","index":4,"n_rows":1047,"n_cols":10,"rows_kept":1047,"cut":false,"hidden":true,"merged":[]}
["CÓDIGO","PROVINCIA","DENOMINACION GENÉRICA","LOCALIDAD","DENOMINACION ESPECÍFICA","DOMICILIO","CODPOSTAL","TELÉFONO","FAX","EMAIL"]
["Introducir código","","","","","","","","",""]
[22000056,"Huesca","Colegio Rural Agrupado","Adahuesca","VERO-ALCANADRE","Avda. .De Santiago Foncillas, S/N",22147,"974 31 82 97",974318297,"craadahuesca@educa.aragon.es"]
[22000071,"Huesca","Colegio de Educación Infantil y Primaria","Aínsa","ASUNCIÓN PAÑART MONTANER","Cl. Cortes De Aragón, 1-3",22330,"974 51 00 40",974510040,"cpainsa@educa.aragon.es"]
[22000251,"Huesca","Colegio de Educación Infantil y Primaria","Alcolea de Cinca","JOSÉ MANUEL BLECUA","Avda. Autonomía De Aragón, S/N",22410,"974 46 85 85","974 46 85 85","cpalcolea@educa.aragon.es"]
[22000299,"Huesca","Colegio de Educación Infantil y Primaria","Almudévar","SANTOS SAMPER SARASA","Cl. Las Ciencias, S/N",22270,"974 250 218","974 250 218","cpssalmudevar@educa.aragon.es"]
[22000585,"Huesca","Centro Público Integrado","Ayerbe","RAMÓN Y CAJAL","Cl. Progreso, 4",22800,"974 38 00 28","974 38 00 28","cpayerbe@educa.aragon.es"]
[22000706,"Huesca","Colegio de Educación Infantil y Primaria","Ballobar","FRANCISCO GALIAY SARAÑANA","Cl. Barrio Nuevo, S/N",22234,"974 46 11 97",974461197,"cpballobar@educa.aragon.es"]
[22000721,"Huesca","Colegio de Educación Infantil y Primaria","Barbastro","ALTO ARAGÓN","Avda. Del Cinca, S/N",22300,"974 31 19 76","974 31 19 76","cpaabarbastro@educa.aragon.es"]
[22000731,"Huesca","Colegio de Educación Infantil y Primaria","Barbastro","LA MERCED","Cl. Beato Florentino Asensio, S/N",22300,"974 313813","974 306275","cplmbarbastro@educa.aragon.es"]
[22000767,"Huesca","Centro Privado de Educación Infantil Primaria y Secundaria","Barbastro","SAN VICENTE DE PAÚL","Cami. Real De Zaragoza, S/N",22300,"974 31 02 95","974 31 45 31","svpaulbar@planalfa.es"]
[22000779,"Huesca","Centro Privado de Educación Infantil Primaria y Secundaria","Barbastro","SAN JOSÉ DE CALASANZ","Pza. Constitución, 2",22300,"974 31 43 31","974 31 50 55","sjcalasanzbar@escolapiosemaus.org"]
[22000809,"Huesca","Instituto de Educación Secundaria","Barbastro","HERMANOS ARGENSOLA","Avda. Del Cinca, S/N",22300,"974 31 17 38","974 31 14 38","ieshabarbastro@educa.aragon.es"]
[22001073,"Huesca","Colegio de Educación Infantil y Primaria","Binéfar","VÍCTOR MENDOZA MENDOZA","CL. ALMACELLAS, 31",22500,"974 42 83 50","974 42 83 77","cpbinefar@educa.aragon.es"]
[22001085,"Huesca","Centro Privado de Educación Infantil Primaria y Secundaria","Binéfar","VIRGEN DEL ROMERAL","Cl. Mariano De Pano, 5 Y 7",22500,"974 42 80 84","974 43 08 39","virgenromeral@colegiosaragon.org"]
[22001191,"Huesca","Colegio de Educación Infantil y Primaria","Bolea","VIRGEN DE LA SOLEDAD","Cl. Carretera, 6",22160,"974 27 25 62",null,"cpbolea@educa.aragon.es"]
[22001218,"Huesca","Escuela Hogar","Boltaña","DE BOLTAÑA","Cl. Samper, S/N",22340,"974 50 20 75","974 50 23 06","ehboltana@educa.aragon.es"]
[22001243,"Huesca","Colegio Rural Agrupado","Broto","ALTO ARA","Avda. Ordesa, 1",22370,"974 486 317","974 486 317","crabroto@educa.aragon.es"]
[22001358,"Huesca","Colegio de Educación Infantil y Primaria","Campo","CERBÍN","Pza. Cabovila, 5",22450,"974 55 01 80",null,"cpcampo@educa.aragon.es"]
[22001437,"Huesca","Colegio de Educación Infantil y Primaria","Canfranc-Estación","LOS ARAÑONES","Pza. De Las Escuelas S/N",22880,"974 37 30 15",974373015,"cpcanfranc@educa.aragon.es"]
{"$rows_left_out":1028}
{"sheet":"dir20190527","index":5,"n_rows":1084,"n_cols":10,"rows_kept":1084,"cut":false,"hidden":true,"merged":[]}
["CÓDIGO","PROVINCIA","DENOMINACION GENÉRICA","LOCALIDAD","DENOMINACION ESPECÍFICA","DOMICILIO","CODPOSTAL","TELÉFONO","FAX","EMAIL"]
[22000056,"Huesca","Colegio Rural Agrupado","Adahuesca","VERO-ALCANADRE","Avda. .De Santiago Foncillas, S/N",22147,"974 31 82 97",974318297,"craadahuesca@educa.aragon.es"]
[22000071,"Huesca","Colegio de Educación Infantil y Primaria","Aínsa","ASUNCIÓN PAÑART MONTANER","Cl. Cortes De Aragón, 1-3",22330,"974 51 00 40",974510040,"cpainsa@educa.aragon.es"]
[22000251,"Huesca","Colegio de Educación Infantil y Primaria","Alcolea de Cinca","JOSÉ MANUEL BLECUA","Avda. Autonomía De Aragón, S/N",22410,"974 46 85 85","974 46 85 85","cpalcolea@educa.aragon.es"]
[22000299,"Huesca","Colegio de Educación Infantil y Primaria","Almudévar","SANTOS SAMPER SARASA","Cl. Las Ciencias, S/N",22270,"974 250 218","974 250 218","cpssalmudevar@educa.aragon.es"]
[22000585,"Huesca","Centro Público Integrado","Ayerbe","RAMÓN Y CAJAL","Cl. Progreso, 4",22800,"974 38 00 28","974 38 00 28","cpayerbe@educa.aragon.es"]
[22000706,"Huesca","Colegio de Educación Infantil y Primaria","Ballobar","FRANCISCO GALIAY SARAÑANA","Cl. Barrio Nuevo, S/N",22234,"974 46 11 97",974461197,"cpballobar@educa.aragon.es"]
[22000721,"Huesca","Colegio de Educación Infantil y Primaria","Barbastro","ALTO ARAGÓN","Avda. Del Cinca, S/N",22300,"974 31 19 76","974 31 19 76","cpaabarbastro@educa.aragon.es"]
[22000731,"Huesca","Colegio de Educación Infantil y Primaria","Barbastro","LA MERCED","Cl. Beato Florentino Asensio, S/N",22300,"974 313813","974 306275","cplmbarbastro@educa.aragon.es"]
[22000767,"Huesca","Centro Privado de Educación Infantil Primaria y Secundaria","Barbastro","SAN VICENTE DE PAÚL","Cami. Real De Zaragoza, S/N",22300,"974 31 02 95","974 31 45 31","svpaulbar@planalfa.es"]
[22000779,"Huesca","Centro Privado de Educación Infantil Primaria y Secundaria","Barbastro","SAN JOSÉ DE CALASANZ","Pza. Constitución, 2",22300,"974 31 43 31","974 31 50 55","sjcalasanzbar@escolapiosemaus.org"]
[22000809,"Huesca","Instituto de Educación Secundaria","Barbastro","HERMANOS ARGENSOLA","Avda. Del Cinca, S/N",22300,"974 31 17 38","974 31 14 38","ieshabarbastro@educa.aragon.es"]
[22001073,"Huesca","Colegio de Educación Infantil y Primaria","Binéfar","VÍCTOR MENDOZA MENDOZA","CL. ALMACELLAS, 31",22500,"974 42 83 50","974 42 83 77","cpbinefar@educa.aragon.es"]
[22001085,"Huesca","Centro Privado de Educación Infantil Primaria y Secundaria","Binéfar","VIRGEN DEL ROMERAL","Cl. Mariano De Pano, 5 Y 7",22500,"974 42 80 84","974 43 08 39","virgenromeral@colegiosaragon.org"]
[22001191,"Huesca","Colegio de Educación Infantil y Primaria","Bolea","VIRGEN DE LA SOLEDAD","Cl. Carretera, 6",22160,"974 27 25 62",null,"cpbolea@educa.aragon.es"]
[22001218,"Huesca","Escuela Hogar","Boltaña","DE BOLTAÑA","Cl. Samper, S/N",22340,"974 50 20 75","974 50 23 06","ehboltana@educa.aragon.es"]
[22001243,"Huesca","Colegio Rural Agrupado","Broto","ALTO ARA","Cl. Santa Cruz, s/n",22370,"974 486 317","974 486 317","crabroto@educa.aragon.es"]
[22001358,"Huesca","Colegio de Educación Infantil y Primaria","Campo","CERBÍN","Pza. Cabovila, 5",22450,"974 55 01 80",null,"cpcampo@educa.aragon.es"]
[22001437,"Huesca","Colegio de Educación Infantil y Primaria","Canfranc-Estación","LOS ARAÑONES","Pza. De Las Escuelas S/N",22880,"974 37 30 15",974373015,"cpcanfranc@educa.aragon.es"]
[22001656,"Huesca","Colegio de Educación Infantil y Primaria","Chalamera","RAMÓN J. SENDER","Cl. Extramuros, S/N",22233,"974 46 16 17",null,"cpchalamera@educa.aragon.es"]
{"$rows_left_out":1064}